Show Posts

This section allows you to view all posts made by this member. Note that you can only see posts made in areas you currently have access to.


Messages - Kitty Hello

Pages: [1] 2 3 ... 706
1
GLBasic - en / Re: Creating a Windows icon
« on: 2023-Jan-12 »
Just create an icon.png file and add it to the project folder. The Compiler will add it as a resource to your exe file.

2
Nein. Das sortiert immer alle Daten. Aber gewöhne Dir doch bitte an auch den Index 0 zu verwenden :)

3
die kommt von
DIM x[2]; // x[0]=0
x[1] = 1; // jetzt ist immer noch x[0]=0

4
z(i) muss z sein, sonst fehlt dir die Funktion "z".

5
GLBasic - en / Re: Steam HTML5 Compiler
« on: 2023-Jan-09 »
I'll try to update the HTML5 libraries. Did you try the "fulscreen" option and/or the MOUSEAXIS instead MOUSESTATE?

6
DIM macht immer ein Feld das auch
  • beinhaltet. Wenn Du das sortierst, aber nur bei [1] bis [6] Werte ablegst, sortiert er den 0er von
  • mit rein. :)

7
Hab das gleiche Problem. Ich sitze am Wochenende mal dran...

8
One step further. Still getting 3 errors now:
Code: (glbasic) [Select]
> Task :app:buildNdkBuildDebug[arm64-v8a] FAILED
C/C++: ld: error: C:\Users\gf\Documents\GLBasic\TwinTris\distribute\android_studio\app\build\intermediates\cxx\Debug\636m5v26/obj/local/arm64-v8a/objs-debug/main/glbasic/lib_glbasic.o: unable to find library from dependent library specifier: SDL.lib
...

Execution failed for task ':app:checkDebugAarMetadata'.
> Configuration `:app:debugRuntimeClasspath` contains AndroidX dependencies, but the `android.useAndroidX` property is not enabled, which may cause runtime issues.
  Set `android.useAndroidX=true` in the `gradle.properties` file and retry.
....


> com.android.ide.common.process.ProcessException: make: Nothing to be done for 'SDL2'.
  make: Nothing to be done for 'SDL2_mixer'.
  make: Nothing to be done for 'hidapi'.
  make: Nothing to be done for 'jpg'.
  [arm64-v8a] SharedLibrary  : libmain.so
 
  C++ build system [build] failed while executing:
      @echo off
      "C:\\Users\\gf\\AppData\\Local\\Android\\Sdk\\ndk\\23.1.7779620\\ndk-build.cmd" ^
        "NDK_PROJECT_PATH=null" ^
        "APP_BUILD_SCRIPT=C:\\Users\\gf\\Documents\\GLBasic\\TwinTris\\distribute\\android_studio\\app\\jni\\Android.mk" ^
        "NDK_APPLICATION_MK=C:\\Users\\gf\\Documents\\GLBasic\\TwinTris\\distribute\\android_studio\\app\\jni\\Application.mk" ^
        "APP_ABI=arm64-v8a" ^
        "NDK_ALL_ABIS=arm64-v8a" ^
        "NDK_DEBUG=1" ^
        "NDK_OUT=C:\\Users\\gf\\Documents\\GLBasic\\TwinTris\\distribute\\android_studio\\app\\build\\intermediates\\cxx\\Debug\\636m5v26/obj" ^
        "NDK_LIBS_OUT=C:\\Users\\gf\\Documents\\GLBasic\\TwinTris\\distribute\\android_studio\\app\\build\\intermediates\\cxx\\Debug\\636m5v26/lib" ^
        "APP_PLATFORM=android-18" ^
        SDL2 ^
        SDL2_mixer ^
        hidapi ^
        jpg ^
        main ^
        mpg123 ^
        png ^
        zlib
    from C:\Users\gf\Documents\GLBasic\TwinTris\distribute\android_studio\app
  ld: error: C:\Users\gf\Documents\GLBasic\TwinTris\distribute\android_studio\app\build\intermediates\cxx\Debug\636m5v26/obj/local/arm64-v8a/objs-debug/main/glbasic/lib_glbasic.o: unable to find library from dependent library specifier: SDL.lib
  ld: error: C:\Users\gf\Documents\GLBasic\TwinTris\distribute\android_studio\app\build\intermediates\cxx\Debug\636m5v26/obj/local/arm64-v8a/objs-debug/main/glbasic/lib_glbasic.o: unable to find library from dependent library specifier: SDL_mixer.lib
  ld: error: C:\Users\gf\Documents\GLBasic\TwinTris\distribute\android_studio\app\build\intermediates\cxx\Debug\636m5v26/obj/local/arm64-v8a/objs-debug/main/glbasic/lib_glbasic.o: unable to find library from dependent library specifier: SDLmain.lib
  ld: error: C:\Users\gf\Documents\GLBasic\TwinTris\distribute\android_studio\app\build\intermediates\cxx\Debug\636m5v26/obj/local/arm64-v8a/objs-debug/main/glbasic/lib_glbasic.o: unable to find library from dependent library specifier: SDL_mixer.lib
  clang++: error: linker command failed with exit code 1 (use -v to see invocation)
  make: *** [C:/Users/gf/AppData/Local/Android/Sdk/ndk/23.1.7779620/build//../build/core/build-binary.mk:715: C:\Users\gf\Documents\GLBasic\TwinTris\distribute\android_studio\app\build\intermediates\cxx\Debug\636m5v26/obj/local/arm64-v8a/libmain.so] Error 1


9
Merry Christmas to all of you, too.

For unto you is born this day in the city of David a Saviour, which is Christ the Lord
Luk. 2:11

For WHOSOEVER shall call upon the name of the Lord: SHALL. BE. SAVED.
Rom.10:13

10
I found, I had to change
In File -> Project Structure, set Android Gradle Plugin Version 7.0.3 And Gradle Version 7.0.2.
I chose 7.3.1 and 7.6.
Then, Android Studio downloaded the NDK for me and it seems, that it built it properly.
Now, stdafx_sdl.h is missing :)
It's quite an adventure.

11
Hello. Now it's me having trouble. I deleted the android_studio folder and re-created everything. Then fired up the freshly installed Android Studio and got some errors:
Code: (glbasic) [Select]
cvc-complex-type.2.4.a: Invalid content was found starting with element 'extension-level'. One of '{layoutlib}' is expected.
cvc-complex-type.2.4.a: Invalid content was found starting with element 'base-extension'. One of '{codename, tag}' is expected.

> java.lang.NullPointerException (no error message)

* Try:
Run with --info or --debug option to get more log output. Run with --scan to get full insights.

* Exception is:
org.gradle.api.ProjectConfigurationException: A problem occurred configuring project ':app'.
at org.gradle.configuration.project.LifecycleProjectEvaluator.wrapException(LifecycleProjectEvaluator.java:79)
at org.gradle.configuration.project.LifecycleProjectEvaluator.addConfigurationFailure(LifecycleProjectEvaluator.java:72)
at org.gradle.configuration.project.LifecycleProjectEvaluator.access$600(LifecycleProjectEvaluator.java:53)
at org.gradle.configuration.project.LifecycleProjectEvaluator$NotifyAfterEvaluate.run(LifecycleProjectEvaluator.java:198)
at org.gradle.internal.operations.DefaultBuildOperationExecutor$RunnableBuildOperationWorker.execute(DefaultBuildOperationExecutor.java:301)
at org.gradle.internal.operations.DefaultBuildOperationExecutor$RunnableBuildOperationWorker.execute(DefaultBuildOperationExecutor.java:293)
at org.gradle.internal.operations.DefaultBuildOperationExecutor.execute(DefaultBuildOperationExecutor.java:175)
at org.gradle.internal.operations.DefaultBuildOperationExecutor.run(DefaultBuildOperationExecutor.java:91)
at org.gradle.internal.operations.DelegatingBuildOperationExecutor.run(DelegatingBuildOperationExecutor.java:31)
at org.gradle.configuration.project.LifecycleProjectEvaluator$EvaluateProject$1.run(LifecycleProjectEvaluator.java:111)
at org.gradle.internal.Factories$1.create(Factories.java:25)
at org.gradle.internal.work.DefaultWorkerLeaseService.withLocks(DefaultWorkerLeaseService.java:183)
at org.gradle.internal.work.StopShieldingWorkerLeaseService.withLocks(StopShieldingWorkerLeaseService.java:40)
at org.gradle.api.internal.project.DefaultProjectStateRegistry$ProjectStateImpl.withProjectLock(DefaultProjectStateRegistry.java:226)
at org.gradle.api.internal.project.DefaultProjectStateRegistry$ProjectStateImpl.withMutableState(DefaultProjectStateRegistry.java:220)
at org.gradle.api.internal.project.DefaultProjectStateRegistry$ProjectStateImpl.withMutableState(DefaultProjectStateRegistry.java:186)
at org.gradle.configuration.project.LifecycleProjectEvaluator$EvaluateProject.run(LifecycleProjectEvaluator.java:95)
at org.gradle.internal.operations.DefaultBuildOperationExecutor$RunnableBuildOperationWorker.execute(DefaultBuildOperationExecutor.java:301)
at org.gradle.internal.operations.DefaultBuildOperationExecutor$RunnableBuildOperationWorker.execute(DefaultBuildOperationExecutor.java:293)
at org.gradle.internal.operations.DefaultBuildOperationExecutor.execute(DefaultBuildOperationExecutor.java:175)
at org.gradle.internal.operations.DefaultBuildOperationExecutor.run(DefaultBuildOperationExecutor.java:91)
at org.gradle.internal.operations.DelegatingBuildOperationExecutor.run(DelegatingBuildOperationExecutor.java:31)
at org.gradle.configuration.project.LifecycleProjectEvaluator.evaluate(LifecycleProjectEvaluator.java:67)
at org.gradle.api.internal.project.DefaultProject.evaluate(DefaultProject.java:693)
at org.gradle.api.internal.project.DefaultProject.evaluate(DefaultProject.java:141)
at org.gradle.execution.TaskPathProjectEvaluator.configure(TaskPathProjectEvaluator.java:35)
at org.gradle.execution.TaskPathProjectEvaluator.configureHierarchy(TaskPathProjectEvaluator.java:62)
at org.gradle.configuration.DefaultBuildConfigurer.configure(DefaultBuildConfigurer.java:41)
at org.gradle.initialization.DefaultGradleLauncher$ConfigureBuild.run(DefaultGradleLauncher.java:302)
at org.gradle.internal.operations.DefaultBuildOperationExecutor$RunnableBuildOperationWorker.execute(DefaultBuildOperationExecutor.java:301)
at org.gradle.internal.operations.DefaultBuildOperationExecutor$RunnableBuildOperationWorker.execute(DefaultBuildOperationExecutor.java:293)
at org.gradle.internal.operations.DefaultBuildOperationExecutor.execute(DefaultBuildOperationExecutor.java:175)
at org.gradle.internal.operations.DefaultBuildOperationExecutor.run(DefaultBuildOperationExecutor.java:91)
at org.gradle.internal.operations.DelegatingBuildOperationExecutor.run(DelegatingBuildOperationExecutor.java:31)
at org.gradle.initialization.DefaultGradleLauncher.configureBuild(DefaultGradleLauncher.java:210)
at org.gradle.initialization.DefaultGradleLauncher.doBuildStages(DefaultGradleLauncher.java:151)
at org.gradle.initialization.DefaultGradleLauncher.executeTasks(DefaultGradleLauncher.java:134)
at org.gradle.internal.invocation.GradleBuildController$1.execute(GradleBuildController.java:58)
at org.gradle.internal.invocation.GradleBuildController$1.execute(GradleBuildController.java:55)
at org.gradle.internal.invocation.GradleBuildController$3.create(GradleBuildController.java:82)
at org.gradle.internal.invocation.GradleBuildController$3.create(GradleBuildController.java:75)
at org.gradle.internal.work.DefaultWorkerLeaseService.withLocks(DefaultWorkerLeaseService.java:183)
at org.gradle.internal.work.StopShieldingWorkerLeaseService.withLocks(StopShieldingWorkerLeaseService.java:40)
at org.gradle.internal.invocation.GradleBuildController.doBuild(GradleBuildController.java:75)
at org.gradle.internal.invocation.GradleBuildController.run(GradleBuildController.java:55)
at org.gradle.tooling.internal.provider.runner.ClientProvidedPhasedActionRunner.run(ClientProvidedPhasedActionRunner.java:60)
at org.gradle.launcher.exec.ChainingBuildActionRunner.run(ChainingBuildActionRunner.java:35)
at org.gradle.launcher.exec.ChainingBuildActionRunner.run(ChainingBuildActionRunner.java:35)
at org.gradle.launcher.exec.BuildOutcomeReportingBuildActionRunner.run(BuildOutcomeReportingBuildActionRunner.java:58)
at org.gradle.tooling.internal.provider.ValidatingBuildActionRunner.run(ValidatingBuildActionRunner.java:32)
at org.gradle.launcher.exec.BuildCompletionNotifyingBuildActionRunner.run(BuildCompletionNotifyingBuildActionRunner.java:39)
at org.gradle.launcher.exec.RunAsBuildOperationBuildActionRunner$3.call(RunAsBuildOperationBuildActionRunner.java:49)
at org.gradle.launcher.exec.RunAsBuildOperationBuildActionRunner$3.call(RunAsBuildOperationBuildActionRunner.java:44)
at org.gradle.internal.operations.DefaultBuildOperationExecutor$CallableBuildOperationWorker.execute(DefaultBuildOperationExecutor.java:315)
at org.gradle.internal.operations.DefaultBuildOperationExecutor$CallableBuildOperationWorker.execute(DefaultBuildOperationExecutor.java:305)
at org.gradle.internal.operations.DefaultBuildOperationExecutor.execute(DefaultBuildOperationExecutor.java:175)
at org.gradle.internal.operations.DefaultBuildOperationExecutor.call(DefaultBuildOperationExecutor.java:101)
at org.gradle.internal.operations.DelegatingBuildOperationExecutor.call(DelegatingBuildOperationExecutor.java:36)
at org.gradle.launcher.exec.RunAsBuildOperationBuildActionRunner.run(RunAsBuildOperationBuildActionRunner.java:44)
at org.gradle.launcher.exec.InProcessBuildActionExecuter$1.transform(InProcessBuildActionExecuter.java:49)
at org.gradle.launcher.exec.InProcessBuildActionExecuter$1.transform(InProcessBuildActionExecuter.java:46)
at org.gradle.composite.internal.DefaultRootBuildState.run(DefaultRootBuildState.java:78)
at org.gradle.launcher.exec.InProcessBuildActionExecuter.execute(InProcessBuildActionExecuter.java:46)
at org.gradle.launcher.exec.InProcessBuildActionExecuter.execute(InProcessBuildActionExecuter.java:31)
at org.gradle.launcher.exec.BuildTreeScopeBuildActionExecuter.execute(BuildTreeScopeBuildActionExecuter.java:42)
at org.gradle.launcher.exec.BuildTreeScopeBuildActionExecuter.execute(BuildTreeScopeBuildActionExecuter.java:28)
at org.gradle.tooling.internal.provider.ContinuousBuildActionExecuter.execute(ContinuousBuildActionExecuter.java:78)
at org.gradle.tooling.internal.provider.ContinuousBuildActionExecuter.execute(ContinuousBuildActionExecuter.java:52)
at org.gradle.tooling.internal.provider.SubscribableBuildActionExecuter.execute(SubscribableBuildActionExecuter.java:59)
at org.gradle.tooling.internal.provider.SubscribableBuildActionExecuter.execute(SubscribableBuildActionExecuter.java:36)
at org.gradle.tooling.internal.provider.SessionScopeBuildActionExecuter.execute(SessionScopeBuildActionExecuter.java:68)
at org.gradle.tooling.internal.provider.SessionScopeBuildActionExecuter.execute(SessionScopeBuildActionExecuter.java:38)
at org.gradle.tooling.internal.provider.GradleThreadBuildActionExecuter.execute(GradleThreadBuildActionExecuter.java:37)
at org.gradle.tooling.internal.provider.GradleThreadBuildActionExecuter.execute(GradleThreadBuildActionExecuter.java:26)
at org.gradle.tooling.internal.provider.ParallelismConfigurationBuildActionExecuter.execute(ParallelismConfigurationBuildActionExecuter.java:43)
at org.gradle.tooling.internal.provider.ParallelismConfigurationBuildActionExecuter.execute(ParallelismConfigurationBuildActionExecuter.java:29)
at org.gradle.tooling.internal.provider.StartParamsValidatingActionExecuter.execute(StartParamsValidatingActionExecuter.java:60)
at org.gradle.tooling.internal.provider.StartParamsValidatingActionExecuter.execute(StartParamsValidatingActionExecuter.java:32)
at org.gradle.tooling.internal.provider.SessionFailureReportingActionExecuter.execute(SessionFailureReportingActionExecuter.java:55)
at org.gradle.tooling.internal.provider.SessionFailureReportingActionExecuter.execute(SessionFailureReportingActionExecuter.java:41)
at org.gradle.tooling.internal.provider.SetupLoggingActionExecuter.execute(SetupLoggingActionExecuter.java:48)
at org.gradle.tooling.internal.provider.SetupLoggingActionExecuter.execute(SetupLoggingActionExecuter.java:32)
at org.gradle.launcher.daemon.server.exec.ExecuteBuild.doBuild(ExecuteBuild.java:67)
at org.gradle.launcher.daemon.server.exec.BuildCommandOnly.execute(BuildCommandOnly.java:36)
at org.gradle.launcher.daemon.server.api.DaemonCommandExecution.proceed(DaemonCommandExecution.java:104)
at org.gradle.launcher.daemon.server.exec.WatchForDisconnection.execute(WatchForDisconnection.java:37)
at org.gradle.launcher.daemon.server.api.DaemonCommandExecution.proceed(DaemonCommandExecution.java:104)
at org.gradle.launcher.daemon.server.exec.ResetDeprecationLogger.execute(ResetDeprecationLogger.java:26)
at org.gradle.launcher.daemon.server.api.DaemonCommandExecution.proceed(DaemonCommandExecution.java:104)
at org.gradle.launcher.daemon.server.exec.RequestStopIfSingleUsedDaemon.execute(RequestStopIfSingleUsedDaemon.java:34)
at org.gradle.launcher.daemon.server.api.DaemonCommandExecution.proceed(DaemonCommandExecution.java:104)
at org.gradle.launcher.daemon.server.exec.ForwardClientInput$2.call(ForwardClientInput.java:74)
at org.gradle.launcher.daemon.server.exec.ForwardClientInput$2.call(ForwardClientInput.java:72)
at org.gradle.util.Swapper.swap(Swapper.java:38)
at org.gradle.launcher.daemon.server.exec.ForwardClientInput.execute(ForwardClientInput.java:72)
at org.gradle.launcher.daemon.server.api.DaemonCommandExecution.proceed(DaemonCommandExecution.java:104)
at org.gradle.launcher.daemon.server.exec.LogAndCheckHealth.execute(LogAndCheckHealth.java:55)
at org.gradle.launcher.daemon.server.api.DaemonCommandExecution.proceed(DaemonCommandExecution.java:104)
at org.gradle.launcher.daemon.server.exec.LogToClient.doBuild(LogToClient.java:62)
at org.gradle.launcher.daemon.server.exec.BuildCommandOnly.execute(BuildCommandOnly.java:36)
at org.gradle.launcher.daemon.server.api.DaemonCommandExecution.proceed(DaemonCommandExecution.java:104)
at org.gradle.launcher.daemon.server.exec.EstablishBuildEnvironment.doBuild(EstablishBuildEnvironment.java:81)
at org.gradle.launcher.daemon.server.exec.BuildCommandOnly.execute(BuildCommandOnly.java:36)
at org.gradle.launcher.daemon.server.api.DaemonCommandExecution.proceed(DaemonCommandExecution.java:104)
at org.gradle.launcher.daemon.server.exec.StartBuildOrRespondWithBusy$1.run(StartBuildOrRespondWithBusy.java:50)
at org.gradle.launcher.daemon.server.DaemonStateCoordinator$1.run(DaemonStateCoordinator.java:295)
at org.gradle.internal.concurrent.ExecutorPolicy$CatchAndRecordFailures.onExecute(ExecutorPolicy.java:63)
at org.gradle.internal.concurrent.ManagedExecutorImpl$1.run(ManagedExecutorImpl.java:46)
at org.gradle.internal.concurrent.ThreadFactoryImpl$ManagedThreadRunnable.run(ThreadFactoryImpl.java:55)
Caused by: java.lang.NullPointerException
at com.android.build.gradle.internal.ndk.NdkHandler.getPlatformVersion(NdkHandler.java:121)
at com.android.build.gradle.internal.ndk.NdkHandler.supports64Bits(NdkHandler.java:221)
at com.android.build.gradle.internal.ndk.NdkHandler.getSupportedAbis(NdkHandler.java:269)
at com.android.build.gradle.tasks.ExternalNativeJsonGenerator.createImpl(ExternalNativeJsonGenerator.java:563)
at com.android.build.gradle.tasks.ExternalNativeJsonGenerator.create(ExternalNativeJsonGenerator.java:480)
at com.android.build.gradle.internal.TaskManager.createExternalNativeBuildJsonGenerators(TaskManager.java:1519)
...
[/ocde]

When I try to build, I get:
[code=glbasic]
java.lang.IllegalArgumentException: Each request requires the same not null build mode to be set
at com.android.tools.idea.gradle.project.build.invoker.GradleBuildInvokerImpl.executeAssembleTasks(GradleBuildInvokerImpl.kt:165)
at com.android.tools.idea.gradle.project.build.invoker.GradleBuildInvokerImpl.assemble(GradleBuildInvokerImpl.kt:211)
at com.android.tools.idea.gradle.project.build.invoker.GradleBuildInvokerImpl.assemble(GradleBuildInvokerImpl.kt:205)
at com.android.tools.idea.gradle.actions.MakeGradleProjectAction.doPerform(MakeGradleProjectAction.java:45)
at com.android.tools.idea.gradle.actions.AndroidStudioGradleAction.actionPerformed(AndroidStudioGradleAction.java:63)
at com.intellij.openapi.actionSystem.ex.ActionUtil.lambda$performActionDumbAwareWithCallbacks$4(ActionUtil.java:239)
at com.intellij.openapi.actionSystem.ex.ActionUtil.performDumbAwareWithCallbacks(ActionUtil.java:260)
at com.intellij.openapi.actionSystem.ex.ActionUtil.performActionDumbAwareWithCallbacks(ActionUtil.java:239)
at com.intellij.openapi.actionSystem.impl.ActionMenuItem$ActionTransmitter.lambda$performAction$0(ActionMenuItem.java:277)
at com.intellij.openapi.wm.impl.FocusManagerImpl.runOnOwnContext(FocusManagerImpl.java:236)
at com.intellij.openapi.wm.impl.IdeFocusManagerImpl.runOnOwnContext(IdeFocusManagerImpl.java:67)
at com.intellij.openapi.actionSystem.impl.ActionMenuItem$ActionTransmitter.performAction(ActionMenuItem.java:269)
at com.intellij.openapi.actionSystem.impl.ActionMenuItem$ActionTransmitter.actionPerformed(ActionMenuItem.java:284)
at java.desktop/javax.swing.AbstractButton.fireActionPerformed(AbstractButton.java:1967)
at com.intellij.openapi.actionSystem.impl.ActionMenuItem.lambda$fireActionPerformed$2(ActionMenuItem.java:111)
at com.intellij.openapi.application.TransactionGuardImpl.performUserActivity(TransactionGuardImpl.java:94)
at com.intellij.openapi.actionSystem.impl.ActionMenuItem.fireActionPerformed(ActionMenuItem.java:111)
at com.intellij.ui.plaf.beg.BegMenuItemUI.doClick(BegMenuItemUI.java:541)
at com.intellij.ui.plaf.beg.BegMenuItemUI$MyMouseInputHandler.mouseReleased(BegMenuItemUI.java:571)
at java.desktop/java.awt.Component.processMouseEvent(Component.java:6654)
at java.desktop/javax.swing.JComponent.processMouseEvent(JComponent.java:3345)
at java.desktop/java.awt.Component.processEvent(Component.java:6419)
at java.desktop/java.awt.Container.processEvent(Container.java:2263)
at java.desktop/java.awt.Component.dispatchEventImpl(Component.java:5029)
at java.desktop/java.awt.Container.dispatchEventImpl(Container.java:2321)
at java.desktop/java.awt.Component.dispatchEvent(Component.java:4861)
at java.desktop/java.awt.LightweightDispatcher.retargetMouseEvent(Container.java:4918)
at java.desktop/java.awt.LightweightDispatcher.processMouseEvent(Container.java:4547)
at java.desktop/java.awt.LightweightDispatcher.dispatchEvent(Container.java:4488)
at java.desktop/java.awt.Container.dispatchEventImpl(Container.java:2307)
at java.desktop/java.awt.Window.dispatchEventImpl(Window.java:2790)
at java.desktop/java.awt.Component.dispatchEvent(Component.java:4861)
at java.desktop/java.awt.EventQueue.dispatchEventImpl(EventQueue.java:778)
at java.desktop/java.awt.EventQueue$4.run(EventQueue.java:727)
at java.desktop/java.awt.EventQueue$4.run(EventQueue.java:721)
at java.base/java.security.AccessController.doPrivileged(Native Method)
at java.base/java.security.ProtectionDomain$JavaSecurityAccessImpl.doIntersectionPrivilege(ProtectionDomain.java:85)
at java.base/java.security.ProtectionDomain$JavaSecurityAccessImpl.doIntersectionPrivilege(ProtectionDomain.java:95)
at java.desktop/java.awt.EventQueue$5.run(EventQueue.java:751)
at java.desktop/java.awt.EventQueue$5.run(EventQueue.java:749)
at java.base/java.security.AccessController.doPrivileged(Native Method)
at java.base/java.security.ProtectionDomain$JavaSecurityAccessImpl.doIntersectionPrivilege(ProtectionDomain.java:85)
at java.desktop/java.awt.EventQueue.dispatchEvent(EventQueue.java:748)
at com.intellij.ide.IdeEventQueue.defaultDispatchEvent(IdeEventQueue.java:891)
at com.intellij.ide.IdeEventQueue.dispatchMouseEvent(IdeEventQueue.java:820)
at com.intellij.ide.IdeEventQueue._dispatchEvent(IdeEventQueue.java:757)
at com.intellij.ide.IdeEventQueue.lambda$dispatchEvent$6(IdeEventQueue.java:447)
at com.intellij.openapi.progress.impl.CoreProgressManager.computePrioritized(CoreProgressManager.java:818)
at com.intellij.ide.IdeEventQueue.lambda$dispatchEvent$7(IdeEventQueue.java:446)
at com.intellij.openapi.application.impl.ApplicationImpl.runIntendedWriteActionOnCurrentThread(ApplicationImpl.java:805)
at com.intellij.ide.IdeEventQueue.dispatchEvent(IdeEventQueue.java:498)
at java.desktop/java.awt.EventDispatchThread.pumpOneEventForFilters(EventDispatchThread.java:203)
at java.desktop/java.awt.EventDispatchThread.pumpEventsForFilter(EventDispatchThread.java:124)
at java.desktop/java.awt.EventDispatchThread.pumpEventsForHierarchy(EventDispatchThread.java:113)
at java.desktop/java.awt.EventDispatchThread.pumpEvents(EventDispatchThread.java:109)
at java.desktop/java.awt.EventDispatchThread.pumpEvents(EventDispatchThread.java:101)
at java.desktop/java.awt.EventDispatchThread.run(EventDispatchThread.java:90)
Can someone help me, please :)

12
Aweseome. Good to see, you're still at it.
I'd personally go with a more toonish style for the main character. Big eyes, large head. See my Wumbo e.g.:

13
Media Section / Re: STEAM - Asset Creator
« on: 2022-Nov-27 »
I updated this to also create vertical capsules.

14
the rules say, two 1s next to another are not allowed, but it starts with a white 1-1? I don't get it, but hey, it plays great. can you write, how you put this on itch.io?

15
GLBasic - en / Re: Steam HTML5 Compiler
« on: 2022-Oct-16 »
The blue menu is in the template html page. I have to check the volume thing.

Pages: [1] 2 3 ... 706